Target
5-hydroxytryptamine receptor 1A
Ligand
BDBM50022717
Substrate
Meas. Tech.
ChEMBL_1113 (CHEMBL616058)
Ki
11±n/a nM
Citation
 Glennon, RANaiman, NALyon, RATiteler, M Arylpiperazine derivatives as high-affinity 5-HT1A serotonin ligands. J Med Chem 31:1968-71 (1988)  
Target
Name:
5-hydroxytryptamine receptor 1A
Synonyms:
5-HT-1A 5-HT1A 5-hydroxytryptamine receptor 1A (5HT1A) 5ht1a Htr1a Serotonin 1a (5-HT1a) receptor/Adrenergic receptor alpha-1 | Serotonin receptor 1A
Type:
G Protein-Coupled Receptor (GPCR)
Mol. Mass.:
46445.29
Organism:
Rattus norvegicus (rat)
Description:
Binding assays were performed using rat hippocampal membranes.
Residue:
422
  
Inhibitor
Name:
BDBM50022717
Synonyms:
CHEMBL27393 | N-[4-(4-Phenyl-piperazin-1-yl)-butyl]-benzamide
Type:
Small organic molecule
Emp. Form.:
C21H27N3O
Mol. Mass.:
337.4586
SMILES:
O=C(NCCCCN1CCN(CC1)c1ccccc1)c1ccccc1
: