Target
Vasopressin V1a receptor
Ligand
BDBM50459408
Substrate
Meas. Tech.
ChEMBL_1766333 (CHEMBL4201580)
Ki
0.300000±n/a nM
Citation
 Frantz, MCPellissier, LPPflimlin, ELoison, SGandía, JMarsol, CDurroux, TMouillac, BBecker, JAJLe Merrer, JValencia, CVilla, PBonnet, DHibert, M LIT-001, the First Nonpeptide Oxytocin Receptor Agonist that Improves Social Interaction in a Mouse Model of Autism. J Med Chem 61:8670-8692 (2018)  
Target
Name:
Vasopressin V1a receptor
Synonyms:
AVPR V1a AVPR1A V1AR_HUMAN VASOPRESSIN V1A Vasopressin V1 receptor Vasopressin receptor
Type:
Receptor
Mol. Mass.:
46820.18
Organism:
Homo sapiens (Human)
Description:
P37288
Residue:
418
  
Inhibitor
Name:
BDBM50459408
Synonyms:
CHEMBL3307200
Type:
Small organic molecule
Emp. Form.:
C35H38F2N4O4
Mol. Mass.:
616.6974
SMILES:
Cc1occc1C(=O)Nc1ccc(cc1)C(=O)N1CCC(F)(F)\C(=C/C(=O)N2CCC(CC2)N2CCCCC2)c2ccccc12
: