Target
Synaptic vesicular amine transporter
Ligand
BDBM50459630
Substrate
Meas. Tech.
ChEMBL_1766889 (CHEMBL4202136)
Ki
70±n/a nM
Citation
 Provencher, BAEshleman, AJJohnson, RAShi, XKryatova, ONelson, JTian, JGonzalez, MMeltzer, PCJanowsky, A Synthesis and Discovery of Arylpiperidinylquinazolines: New Inhibitors of the Vesicular Monoamine Transporter. J Med Chem 61:9121-9131 (2018)  
Target
Name:
Synaptic vesicular amine transporter
Synonyms:
Monoamine transporter SVMT VAT2 VMAT2_HUMAN | Vesicular amine transporter 2
Type:
PROTEIN
Mol. Mass.:
55709.61
Organism:
Homo sapiens (Human)
Description:
ChEMBL_610810
Residue:
514
  
Inhibitor
Name:
BDBM50459630
Synonyms:
CHEMBL4207658
Type:
Small organic molecule
Emp. Form.:
C24H27N3O4
Mol. Mass.:
421.4889
SMILES:
CCOC(=O)[C@@H]1CN(CCn2c(=O)[nH]c3ccccc3c2=O)CC[C@@H]1c1ccccc1
: