Target
Synaptic vesicular amine transporter
Ligand
BDBM50459619
Substrate
Meas. Tech.
ChEMBL_1766889 (CHEMBL4202136)
Ki
152±n/a nM
Citation
 Provencher, BAEshleman, AJJohnson, RAShi, XKryatova, ONelson, JTian, JGonzalez, MMeltzer, PCJanowsky, A Synthesis and Discovery of Arylpiperidinylquinazolines: New Inhibitors of the Vesicular Monoamine Transporter. J Med Chem 61:9121-9131 (2018)  
Target
Name:
Synaptic vesicular amine transporter
Synonyms:
Monoamine transporter SVMT VAT2 VMAT2_HUMAN | Vesicular amine transporter 2
Type:
PROTEIN
Mol. Mass.:
55709.61
Organism:
Homo sapiens (Human)
Description:
ChEMBL_610810
Residue:
514
  
Inhibitor
Name:
BDBM50459619
Synonyms:
CHEMBL4206824
Type:
Small organic molecule
Emp. Form.:
C19H29NO3
Mol. Mass.:
319.4385
SMILES:
COc1cc2CCN3CC(CC(C)C)C(O)CC3c2cc1OC
: