Target
Dihydrofolate reductase
Ligand
BDBM50022738
Substrate
Meas. Tech.
ChEBML_54599
Ki
0.0283±n/a nM
Citation
 Piper, JRMcCaleb, GSMontgomery, JAKisliuk, RLGaumont, YThorndike, JSirotnak, FM Synthesis and antifolate activity of 5-methyl-5,10-dideaza analogues of aminopterin and folic acid and an alternative synthesis of 5,10-dideazatetrahydrofolic acid, a potent inhibitor of glycinamide ribonucleotide formyltransferase. J Med Chem 31:2164-9 (1988)  
Target
Name:
Dihydrofolate reductase
Synonyms:
DYR_MOUSE | Dhfr
Type:
Enzyme
Mol. Mass.:
21608.82
Organism:
Mus musculus (Mouse)
Description:
Residue:
187
  
Inhibitor
Name:
BDBM50022738
Synonyms:
2-{4-[2-(2,4-Diamino-5-methyl-pyrido[2,3-d]pyrimidin-6-yl)-ethyl]-benzoylamino}-pentanedioic acid | CHEMBL69016
Type:
Small organic molecule
Emp. Form.:
C22H24N6O5
Mol. Mass.:
452.4632
SMILES:
Cc1c(CCc2ccc(cc2)C(=O)NC(CCC(O)=O)C(O)=O)cnc2nc(N)nc(N)c12
: