Target
Thymidylate synthase
Ligand
BDBM50022739
Substrate
Meas. Tech.
ChEBML_209295
IC50
>100000±n/a nM
Citation
 Piper, JRMcCaleb, GSMontgomery, JAKisliuk, RLGaumont, YThorndike, JSirotnak, FM Synthesis and antifolate activity of 5-methyl-5,10-dideaza analogues of aminopterin and folic acid and an alternative synthesis of 5,10-dideazatetrahydrofolic acid, a potent inhibitor of glycinamide ribonucleotide formyltransferase. J Med Chem 31:2164-9 (1988)  
Target
Name:
Thymidylate synthase
Synonyms:
TSase Thymidylate Synthase (TS) thyA
Type:
Enzyme
Mol. Mass.:
36576.54
Organism:
Lactobacillus casei
Description:
Residue:
316
  
Inhibitor
Name:
BDBM50022739
Synonyms:
(6RS) 2-{4-[2-(2-Amino-5-ethyl-4-oxo-3,4,5,6,7,8-hexahydro-pyrido[2,3-d]pyrimidin-6-yl)-ethyl]-benzoylamino}-pentanedioic acid | CHEMBL267890
Type:
Small organic molecule
Emp. Form.:
C23H29N5O6
Mol. Mass.:
471.5063
SMILES:
CCC1C(CCc2ccc(cc2)C(=O)NC(CCC(O)=O)C(O)=O)CNc2nc(N)[nH]c(=O)c12
: