Target
Renin-1
Ligand
BDBM50022865
Substrate
Meas. Tech.
ChEBML_196286
IC50
6500±n/a nM
Citation
 Sham, HLBolis, GStein, HHFesik, SWMarcotte, PAPlattner, JJRempel, CAGreer, J Renin inhibitors. Design and synthesis of a new class of conformationally restricted analogues of angiotensinogen. J Med Chem 31:284-95 (1988)  
Target
Name:
Renin-1
Synonyms:
Angiotensinogenase RENI1_MOUSE Ren-1 Renin | Renin-1
Type:
PROTEIN
Mol. Mass.:
44345.30
Organism:
Mus musculus
Description:
ChEMBL_685608
Residue:
402
  
Inhibitor
Name:
BDBM50022865
Synonyms:
Boc-Phe-His-Leu-Val-Ile-His-OMe | CHEMBL321937
Type:
Small organic molecule
Emp. Form.:
C44H66N10O9
Mol. Mass.:
879.0564
SMILES:
CC[C@H](C)[C@H](NC(=O)[C@@H](NC(=O)[C@H](CC(C)C)NC(=O)[C@H](Cc1cnc[nH]1)NC(=O)[C@H](Cc1ccccc1)NC(=O)OC(C)(C)C)C(C)C)C(=O)N[C@@H](Cc1cnc[nH]1)C(=O)OC
: