Target
Renin
Ligand
BDBM50022862
Substrate
Meas. Tech.
ChEBML_195949
IC50
1400±n/a nM
Citation
 Sham, HLBolis, GStein, HHFesik, SWMarcotte, PAPlattner, JJRempel, CAGreer, J Renin inhibitors. Design and synthesis of a new class of conformationally restricted analogues of angiotensinogen. J Med Chem 31:284-95 (1988)  
Target
Name:
Renin
Synonyms:
Angiotensinogenase RENI_HUMAN
Type:
Enzyme
Mol. Mass.:
45058.99
Organism:
Homo sapiens (Human)
Description:
Residue:
406
  
Inhibitor
Name:
BDBM50022862
Synonyms:
Boc-Phe-Ala-Leu-Val-Ile-His-OMe | CHEMBL101874
Type:
Small organic molecule
Emp. Form.:
C41H64N8O9
Mol. Mass.:
812.9951
SMILES:
CC[C@H](C)[C@H](NC(=O)[C@@H](NC(=O)[C@H](CC(C)C)NC(=O)[C@H](C)NC(=O)[C@H](Cc1ccccc1)NC(=O)OC(C)(C)C)C(C)C)C(=O)N[C@@H](Cc1cnc[nH]1)C(=O)OC
: