Target
Neuronal acetylcholine receptor subunit alpha-7
Ligand
BDBM50459888
Substrate
Meas. Tech.
ChEMBL_1767432 (CHEMBL4219544)
IC50
320±n/a nM
Citation
 Sparling, BADiMauro, EF Progress in the discovery of small molecule modulators of the Cys-loop superfamily receptors. Bioorg Med Chem Lett 27:3207-3218 (2017)  
Target
Name:
Neuronal acetylcholine receptor subunit alpha-7
Synonyms:
ACHA7_HUMAN Cholinergic, Nicotinic Alpha7 Neuronal acetylcholine receptor protein alpha-7 subunit Nicotinic acetylcholine receptor alpha-7 (alpha7 nAChR)
Type:
Mol. Mass.:
56448.33
Organism:
Homo sapiens (Human)
Description:
CHRNA7 (NACHRA7)
Residue:
502
  
Inhibitor
Name:
BDBM50459888
Synonyms:
CHEMBL4225157
Type:
Small organic molecule
Emp. Form.:
C26H30N6
Mol. Mass.:
426.5566
SMILES:
C#CCNc1nc(NCCCCC2CCN(Cc3ccccc3)CC2)c(cc1C#N)C#N
: