Target
Vasopressin V2 receptor
Ligand
BDBM50023752
Substrate
Meas. Tech.
ChEBML_214849
Ki
2700000±n/a nM
Citation
 Moore, MLAlbrightson, CBrickson, BBryan, HGCaldwell, NCallahan, JFFoster, JKinter, LBNewlander, KASchmidt, DB Dicarbavasopressin antagonist analogues exhibit reduced in vivo agonist activity. J Med Chem 31:1487-9 (1988)  
Target
Name:
Vasopressin V2 receptor
Synonyms:
AVPR2 | V2R_PIG
Type:
PROTEIN
Mol. Mass.:
40556.17
Organism:
Sus scrofa
Description:
ChEMBL_214870
Residue:
370
  
Inhibitor
Name:
BDBM50023752
Synonyms:
1-[13-Benzyl-19-carbamoylmethyl-10-(4-ethoxy-benzyl)-16-isopropyl-8,11,14,17,20-pentaoxo-9,12,15,18,21-pentaaza-spiro[5.19]pentacosane-22-carbonyl]-pyrrolidine-2-carboxylic acid (1-carbamoyl-4-guanidino-butyl)-amide | CHEMBL2372316
Type:
Small organic molecule
Emp. Form.:
C53H78N12O10
Mol. Mass.:
1043.2608
SMILES:
[#6]-[#6]-[#8]-c1ccc(-[#6]-[#6@H]-2-[#7]-[#6](=O)-[#6]C3([#6]-[#6]-[#6]-[#6]-[#6]3)[#6]-[#6]-[#6]-[#6](-[#7]-[#6](=O)-[#6@H](-[#6]-[#6](-[#7])=O)-[#7]-[#6](=O)-[#6@@H](-[#7]-[#6](=O)-[#6@H](-[#6]-c3ccccc3)-[#7]-[#6]-2=O)-[#6](-[#6])-[#6])-[#6](=O)-[#7]-2-[#6]-[#6]-[#6]-[#6@@H]-2-[#6](=O)-[#7]-[#6@@H](-[#6]-[#6]-[#6]\[#7]=[#6](\[#7])-[#7])-[#6](-[#7])=O)cc1
: