Target
Sodium-dependent dopamine transporter
Ligand
BDBM82071
Substrate
Meas. Tech.
ChEMBL_1772777 (CHEMBL4229769)
IC50
4430±n/a nM
Citation
 Ramesh, RReddy, DS Quest for Novel Chemical Entities through Incorporation of Silicon in Drug Scaffolds. J Med Chem 61:3779-3798 (2018)  
Target
Name:
Sodium-dependent dopamine transporter
Synonyms:
DA transporter DAT1 Dopamine transporter protein (DAT) SC6A3_HUMAN Sodium-dependent dopamine transporter Solute carrier family 6 member 3
Type:
Multi-pass membrane protein
Mol. Mass.:
68497.11
Organism:
Homo sapiens (Human)
Description:
Q01959
Residue:
620
  
Inhibitor
Name:
BDBM82071
Synonyms:
CAS_93413-69-5 NSC_62923 Venlafaxine hydrochloride WY-45655
Type:
Small organic molecule
Emp. Form.:
C17H27NO2
Mol. Mass.:
277.4018
SMILES:
COc1ccc(cc1)C(CN(C)C)C1(O)CCCCC1
: