Target
Phosphatidylinositol 4,5-bisphosphate 3-kinase catalytic subunit delta isoform
Ligand
BDBM92862
Substrate
Meas. Tech.
ChEMBL_1776141 (CHEMBL4233133)
IC50
78±n/a nM
Citation
 Dong, FDLiu, DDDeng, CLQin, XCChen, KWang, JSong, HRDing, HW Design, synthesis and biological evaluation of novel series of 2H-benzo[b][1,4]oxazin-3(4H)-one and 2H-benzo[b][1,4]oxazine scaffold derivatives as PI3K? inhibitors. Bioorg Med Chem 26:3982-3991 (2018)  
Target
Name:
Phosphatidylinositol 4,5-bisphosphate 3-kinase catalytic subunit delta isoform
Synonyms:
PI3-kinase p110 subunit delta PI3-kinase subunit p110-delta PIK3CD Phosphatidylinositol 4,5-biphosphate 3-kinase catalytic subunit delta (PIK3CD) Phosphatidylinositol 4,5-bisphosphate 3-kinase 110 kDa catalytic subunit delta (PI3K delta) Phosphatidylinositol 4,5-bisphosphate 3-kinase catalytic subunit delta (PI3Kdelta) Phosphatidylinositol 4,5-bisphosphate 3-kinase catalytic subunit delta isoform (PI3K delta) Phosphatidylinositol 4,5-bisphosphate 3-kinase catalytic subunit delta isoform (PI3K-delta) Phosphatidylinositol 4,5-bisphosphate 3-kinase catalytic subunit delta isoform (PI3Kdelta)
Type:
Enzyme Subunit
Mol. Mass.:
119489.41
Organism:
Homo sapiens (Human)
Description:
O00329
Residue:
1044
  
Inhibitor
Name:
BDBM92862
Synonyms:
US9284315, BEZ-235 | mTOR Inhibitor, BEZ235
Type:
Small molecule
Emp. Form.:
C30H23N5O
Mol. Mass.:
469.5365
SMILES:
Cn1c2cnc3ccc(cc3c2n(-c2ccc(cc2)C(C)(C)C#N)c1=O)-c1cnc2ccccc2c1
: