Target
Membrane-associated tyrosine- and threonine-specific cdc2-inhibitory kinase
Ligand
BDBM3096
Substrate
Meas. Tech.
ChEMBL_1776145 (CHEMBL4233137)
IC50
31±n/a nM
Citation
 Platzer, CNajjar, ARohe, AErdmann, FSippl, WSchmidt, M Identification of PKMYT1 inhibitors by screening the GSK published protein kinase inhibitor set I and II. Bioorg Med Chem 26:4014-4024 (2018)  
Target
Name:
Membrane-associated tyrosine- and threonine-specific cdc2-inhibitory kinase
Synonyms:
MYT1 PMYT1_HUMAN | Tyrosine- and threonine-specific cdc2-inhibitory kinase
Type:
PROTEIN
Mol. Mass.:
54523.76
Organism:
Homo sapiens (Human)
Description:
ChEMBL_587209
Residue:
499
  
Inhibitor
Name:
BDBM3096
Synonyms:
2-aminopyrido[2,3-d]pyrimidin-7(8H)-one deriv. 6-(2,6-dichlorophenyl)-2-({4-[2-(diethylamino)ethoxy]phenyl}amino)-8-methyl-7H,8H-pyrido[2,3-d]pyrimidin-7-one D3RKN_84 | PD166285
Type:
Small organic molecule
Emp. Form.:
C26H27Cl2N5O2
Mol. Mass.:
512.431
SMILES:
CCN(CC)CCOc1ccc(Nc2ncc3cc(-c4c(Cl)cccc4Cl)c(=O)n(C)c3n2)cc1
: