Target
Estrogen receptor beta
Ligand
BDBM50462981
Substrate
Meas. Tech.
ChEMBL_1776999 (CHEMBL4233991)
Kd
1990±n/a nM
Citation
 Qin, WXie, MQin, XFang, QYin, FLi, Z Recent advances in peptidomimetics antagonists targeting estrogen receptor ?-coactivator interaction in cancer therapy. Bioorg Med Chem Lett 28:2827-2836 (2018)  
Target
Name:
Estrogen receptor beta
Synonyms:
ER-beta ESR2_HUMAN Estradiol receptor beta (ERβ) Estrogen receptor (ER beta) Estrogen receptor beta (ER beta) NR3A2 estrogen beta
Type:
Protein
Mol. Mass.:
59238.43
Organism:
Homo sapiens (Human)
Description:
Q92731
Residue:
530
  
Inhibitor
Name:
BDBM50462981
Synonyms:
CHEMBL4247363
Type:
Small organic molecule
Emp. Form.:
C64H103N17O16
Mol. Mass.:
1366.6069
SMILES:
CC[C@H](C)[C@@H]1NC(=O)[C@](C)(CCC\C=C/CCC[C@](C)(NC(=O)[C@H](Cc2cnc[nH]2)NC(=O)[C@H](CC(C)C)NC1=O)C(=O)N[C@@H](CC(C)C)C(=O)N[C@@H](CC(C)C)C(=O)N[C@@H](CCC(N)=O)C(=O)N[C@@H](CC(O)=O)C(=O)N[C@@H](CO)C(N)=O)NC(=O)[C@H](Cc1cnc[nH]1)NC(C)=O
: