Target
Rho-associated protein kinase 1
Ligand
BDBM50463496
Substrate
Meas. Tech.
ChEMBL_1778312 (CHEMBL4235304)
Ki
19±n/a nM
Citation
 Bandarage, UKCao, JCome, JHCourt, JJGao, HJacobs, MDMarhefka, CNanthakumar, SGreen, J ROCK inhibitors 3: Design, synthesis and structure-activity relationships of 7-azaindole-based Rho kinase (ROCK) inhibitors. Bioorg Med Chem Lett 28:2622-2626 (2018)  
Target
Name:
Rho-associated protein kinase 1
Synonyms:
ROCK-I ROCK1_HUMAN Rho-associated protein kinase Rho-associated, coiled-coil-containing protein kinase 1 Rho-kinase (ROCK I) p160 ROCK-1 | p160ROCK
Type:
Serine/threonine-protein kinase
Mol. Mass.:
158156.77
Organism:
Homo sapiens (Human)
Description:
Q13464
Residue:
1354
  
Inhibitor
Name:
BDBM50463496
Synonyms:
CHEMBL4243123
Type:
Small organic molecule
Emp. Form.:
C20H19N5O3S2
Mol. Mass.:
441.527
SMILES:
CCNS(=O)(=O)c1cccc(CC(=O)Nc2nc(cs2)-c2c[nH]c3ncccc23)c1
: