Target
Tyrosine-protein kinase Tec
Ligand
BDBM165209
Substrate
Meas. Tech.
ChEMBL_1778711 (CHEMBL4235703)
IC50
0.900000±n/a nM
Citation
 Liu, QBatt, DGChaudhry, CLippy, JSPattoli, MASurti, NXu, SCarter, PHBurke, JRTino, JA Conversion of carbazole carboxamide based reversible inhibitors of Bruton's tyrosine kinase (BTK) into potent, selective irreversible inhibitors in the carbazole, tetrahydrocarbazole, and a new 2,3-dimethylindole series. Bioorg Med Chem Lett 28:3080-3084 (2018)  
Target
Name:
Tyrosine-protein kinase Tec
Synonyms:
PSCTK4 TEC_HUMAN | Tyrosine-protein kinase TEC (TEC)
Type:
Protein
Mol. Mass.:
73597.00
Organism:
Homo sapiens (Human)
Description:
Residue:
631
  
Inhibitor
Name:
BDBM165209
Synonyms:
US10604504, Example 34 US9688629, 34 US9920031, Example 34
Type:
Small organic molecule
Emp. Form.:
C20H21N3O3S
Mol. Mass.:
383.464
SMILES:
Cc1[nH]c2c(ccc(-c3cccc(NS(=O)(=O)C=C)c3C)c2c1C)C(N)=O
: