Target
Trifunctional purine biosynthetic protein adenosine-3
Ligand
BDBM50017876
Substrate
Meas. Tech.
ChEMBL_70043 (CHEMBL681443)
Ki
16000±n/a nM
Citation
 Caperelli, CA N10-substituted 5,8-dideazafolate inhibitors of glycinamide ribonucleotide transformylase. J Med Chem 30:1254-6 (1987)  
Target
Name:
Trifunctional purine biosynthetic protein adenosine-3
Synonyms:
GAR transformylase PUR2_MOUSE
Type:
PROTEIN
Mol. Mass.:
107504.27
Organism:
Mus musculus
Description:
ChEMBL_497843
Residue:
1010
  
Inhibitor
Name:
BDBM50017876
Synonyms:
2-{4-[(2-Amino-4-oxo-3,4-dihydro-quinazolin-6-ylmethyl)-ethyl-amino]-benzoylamino}-pentanedioic acid | CHEMBL22632
Type:
Small organic molecule
Emp. Form.:
C23H25N5O6
Mol. Mass.:
467.4745
SMILES:
CCN(Cc1ccc2nc(N)[nH]c(=O)c2c1)c1ccc(cc1)C(=O)NC(CCC(O)=O)C(O)=O
: