Target
Dihydrofolate reductase
Ligand
BDBM50008294
Substrate
Meas. Tech.
ChEBML_54896
IC50
4900±n/a nM
Citation
 Nair, MGDhawan, RGhazala, MKalman, TIFerone, RGaumont, YKisliuk, RL Folate analogues. 30. Synthesis and biological evaluation of N10-propargyl-5,8-dideaza-5,6,7,8-tetrahydrofolic acid and related compounds. J Med Chem 30:1256-61 (1987)  
Target
Name:
Dihydrofolate reductase
Synonyms:
DYR_LACCA folA
Type:
PROTEIN
Mol. Mass.:
18437.08
Organism:
Lactobacillus casei
Description:
ChEMBL_1357878
Residue:
163
  
Inhibitor
Name:
BDBM50008294
Synonyms:
2-(4-(((2-amino-4-oxo-1,4-dihydroquinazolin-6-yl)methyl)(prop-2-ynyl)amino)benzamido)pentanedioic acid 2-{4-[(2-Amino-4-oxo-3,4-dihydro-quinazolin-6-ylmethyl)-prop-2-ynyl-amino]-benzoylamino}-pentanedioic acid 2-{4-[(2-Amino-4-oxo-3,4-dihydro-quinazolin-6-ylmethyl)-prop-2-ynyl-amino]-benzoylamino}-pentanedioic acid(N10-propargyl-5,8-dideazafolate, PDDF) CHEMBL422395 | PDDF
Type:
Small organic molecule
Emp. Form.:
C24H23N5O6
Mol. Mass.:
477.4693
SMILES:
Nc1nc2ccc(CN(CC#C)c3ccc(cc3)C(=O)NC(CCC(O)=O)C(O)=O)cc2c(=O)[nH]1
: