Target
Cytochrome P450 2D6
Ligand
BDBM50030765
Substrate
Meas. Tech.
ChEMBL_1779090 (CHEMBL4236082)
IC50
>50000±n/a nM
Citation
 Ma, MZhao, JCheng, HDeng, MDing, ZHou, YLi, FDou, GLi, W In vitro and in vivo pharmacokinetic and pharmacodynamic study of MBRI-001, a deuterium-substituted plinabulin derivative as a potent anti-cancer agent. Bioorg Med Chem 26:4687-4692 (2018)  
Target
Name:
Cytochrome P450 2D6
Synonyms:
CP2D6_HUMAN CYP2DL1 Cytochrome P450 2D6 (CYP2D6) P450-DB1
Type:
Protein
Mol. Mass.:
55774.82
Organism:
Homo sapiens (Human)
Description:
P10635
Residue:
497
  
Inhibitor
Name:
BDBM50030765
Synonyms:
NPI-2358 | Plinabulin
Type:
Small organic molecule
Emp. Form.:
C19H20N4O2
Mol. Mass.:
336.3877
SMILES:
CC(C)(C)c1[nH]cnc1\C=c1/[nH]c(=O)\c(=C\c2ccccc2)[nH]c1=O
: