Target
NAD-dependent protein deacetylase sirtuin-1
Ligand
BDBM50463739
Substrate
Meas. Tech.
ChEMBL_1779302 (CHEMBL4236294)
Ki
>10000±n/a nM
Citation
 Fournier, JFBhurruth-Alcor, YMusicki, BAubert, JAurelly, MBouix-Peter, CBouquet, KChantalat, LDelorme, MDrean, BDuvert, GFleury-Bregeot, NGauthier, BGrisendi, KHarris, CSHennequin, LFIsabet, TJoly, FLafitte, GMillois, CMorgentin, RPascau, JPiwnica, DRival, YSoulet, CThoreau, ÉTomas, L Squaramides as novel class I and IIB histone deacetylase inhibitors for topical treatment of cutaneous t-cell lymphoma. Bioorg Med Chem Lett 28:2985-2992 (2018)  
Target
Name:
NAD-dependent protein deacetylase sirtuin-1
Synonyms:
NAD-Dependent Deacetylase Sirtuin-1 NAD-dependent protein deacetylase sirtuin-1 (SIRT1) SIR2-like protein 1 SIRT1 Sirtuin-1 (SIRT1) | hSIR2
Type:
Developmental protein; hydrolase
Mol. Mass.:
81626.66
Organism:
Homo sapiens (Human)
Description:
Residue:
747
  
Inhibitor
Name:
BDBM50463739
Synonyms:
CHEMBL4237803
Type:
Small organic molecule
Emp. Form.:
C17H21N3O5
Mol. Mass.:
347.3657
SMILES:
COc1ccc(Nc2c(NCCCCCC(=O)NO)c(=O)c2=O)cc1
: