Target
Kappa-type opioid receptor
Ligand
BDBM50026614
Substrate
Meas. Tech.
ChEMBL_1780620 (CHEMBL4252137)
Ki
0.053000±n/a nM
Citation
 Helal, MAHabib, ESChittiboyina, AG Selective kappa opioid antagonists for treatment of addiction, are we there yet? Eur J Med Chem 141:632-647 (2017)  
Target
Name:
Kappa-type opioid receptor
Synonyms:
Kappa Opioid Receptor OPRK1 Opiate Kappa 1 | mu/kappa opioid receptor
Type:
G Protein-Coupled Receptor (GPCR)
Mol. Mass.:
42744.99
Organism:
Cavia porcellus (domestic guinea pig)
Description:
P41144
Residue:
380
  
Inhibitor
Name:
BDBM50026614
Synonyms:
CHEMBL575508
Type:
Small organic molecule
Emp. Form.:
C29H41N3O3
Mol. Mass.:
479.6541
SMILES:
CC(C)[C@@H](CN1CC[C@](C)([C@@H](C)C1)c1cccc(O)c1)NC(=O)[C@H]1Cc2ccc(O)cc2CN1C
: