Target
Angiotensin-converting enzyme
Ligand
BDBM50011192
Substrate
Meas. Tech.
ChEBML_34801
IC50
5.7±n/a nM
Citation
 Yanagisawa, HIshihara, SAndo, AKanazaki, TMiyamoto, SKoike, HIijima, YOizumi, KMatsushita, YHata, T Angiotensin-converting enzyme inhibitors: perhydro-1,4-thiazepin-5-one derivatives. J Med Chem 30:1984-91 (1987)  
Target
Name:
Angiotensin-converting enzyme
Synonyms:
3.2.1.- ACE Angiotensin-converting enzyme, soluble form DCP1 Kininase II
Type:
Mol. Mass.:
150405.15
Organism:
Oryctolagus cuniculus
Description:
Residue:
1310
  
Inhibitor
Name:
BDBM50011192
Synonyms:
(R)-1-[(S)-2-((S)-1-Carboxy-3-phenyl-propylamino)-propionyl]-pyrrolidine-2-carboxylic acid 1-((2S)-2-{[(1S)-1-CARBOXY-3-PHENYLPROPYL]AMINO}PROPANOYL)-L-PROLINE 1-[2-(1-Carboxy-3-phenyl-propylamino)-propionyl]-pyrrolidine-2-carboxylic acid 1-[2-(1-Carboxy-3-phenyl-propylamino)-propionyl]-pyrrolidine-2-carboxylic acid(Enalaprilat) CHEMBL577 Lexxel Vaseretic | Vasotec
Type:
Small organic molecule
Emp. Form.:
C18H24N2O5
Mol. Mass.:
348.3936
SMILES:
CC(NC(CCc1ccccc1)C(O)=O)C(=O)N1CCC[C@H]1C(O)=O
: