Target
Muscarinic acetylcholine receptor M3
Ligand
BDBM50024984
Substrate
Meas. Tech.
ChEBML_138367
EC50
300±n/a nM
Citation
 Sauerberg, PLarsen, JJFalch, EKrogsgaard-Larsen, P A novel class of conformationally restricted heterocyclic muscarinic agonists. J Med Chem 29:1004-9 (1986)  
Target
Name:
Muscarinic acetylcholine receptor M3
Synonyms:
ACM3_HUMAN Cholinergic, muscarinic M3 Muscarinic receptor M3 | RecName: Full=Muscarinic acetylcholine receptor M3
Type:
Enzyme
Mol. Mass.:
66151.03
Organism:
Homo sapiens (Human)
Description:
P20309
Residue:
590
  
Inhibitor
Name:
BDBM50024984
Synonyms:
1,2,5,6-Tetrahydro-pyridine-3-carboxylic acid methyl ester CHEMBL268808
Type:
Small organic molecule
Emp. Form.:
C7H11NO2
Mol. Mass.:
141.1677
SMILES:
COC(=O)C1=CCCNC1
: