Target
Muscarinic acetylcholine receptor M3
Ligand
BDBM50024991
Substrate
Meas. Tech.
ChEBML_138367
EC50
20000±n/a nM
Citation
 Sauerberg, PLarsen, JJFalch, EKrogsgaard-Larsen, P A novel class of conformationally restricted heterocyclic muscarinic agonists. J Med Chem 29:1004-9 (1986)  
Target
Name:
Muscarinic acetylcholine receptor M3
Synonyms:
ACM3_HUMAN Cholinergic, muscarinic M3 Muscarinic receptor M3 | RecName: Full=Muscarinic acetylcholine receptor M3
Type:
Enzyme
Mol. Mass.:
66151.03
Organism:
Homo sapiens (Human)
Description:
P20309
Residue:
590
  
Inhibitor
Name:
BDBM50024991
Synonyms:
5-Ethyl-3-methoxy-4,5,6,7-tetrahydro-isoxazolo[4,5-c]pyridin-5-ium; chloride | CHEMBL6568
Type:
Small organic molecule
Emp. Form.:
C9H15N2O2
Mol. Mass.:
183.2271
SMILES:
CC[NH+]1CCc2onc(OC)c2C1
: