Target
Tyrosine-protein kinase JAK3
Ligand
BDBM50465346
Substrate
Meas. Tech.
ChEMBL_1784616 (CHEMBL4256133)
IC50
>100±n/a nM
Citation
 Gao, JBYang, SJYan, ZRZhang, XJPu, DBWang, LXLi, XLZhang, RHXiao, WL Isolation, Characterization, and Structure-Activity Relationship Analysis of Abietane Diterpenoids from Callicarpa bodinieri as Spleen Tyrosine Kinase Inhibitors. J Nat Prod 81:998-1006 (2018)  
Target
Name:
Tyrosine-protein kinase JAK3
Synonyms:
JAK-3 JAK3_HUMAN Janus kinase 3 (JAK3) L-JAK | Leukocyte janus kinase
Type:
Protein
Mol. Mass.:
125111.08
Organism:
Homo sapiens (Human)
Description:
P52333
Residue:
1124
  
Inhibitor
Name:
BDBM50465346
Synonyms:
CHEMBL4286991
Type:
Small organic molecule
Emp. Form.:
C20H28O3
Mol. Mass.:
316.4345
SMILES:
[H][C@@]12CCc3cc(ccc3[C@@]1(C)CCC[C@]2(CO)C(O)=O)C(C)C
: