Target
Lysine--tRNA ligase
Ligand
BDBM50465348
Substrate
Meas. Tech.
ChEMBL_1784613 (CHEMBL4256130)
IC50
22±n/a nM
Citation
 Gao, JBYang, SJYan, ZRZhang, XJPu, DBWang, LXLi, XLZhang, RHXiao, WL Isolation, Characterization, and Structure-Activity Relationship Analysis of Abietane Diterpenoids from Callicarpa bodinieri as Spleen Tyrosine Kinase Inhibitors. J Nat Prod 81:998-1006 (2018)  
Target
Name:
Lysine--tRNA ligase
Synonyms:
KARS KIAA0070 SYK_HUMAN
Type:
PROTEIN
Mol. Mass.:
68044.78
Organism:
Homo sapiens (Human)
Description:
ChEMBL_960665
Residue:
597
  
Inhibitor
Name:
BDBM50465348
Synonyms:
CHEMBL4292650
Type:
Small organic molecule
Emp. Form.:
C22H30O4
Mol. Mass.:
358.4712
SMILES:
[H][C@@]12CCc3cc(ccc3[C@@]1(C)CCC[C@@]2(CC(=O)OC)C(O)=O)C(C)C
: