Target
Alpha-1A/Alpha-1B/Alpha-1D adrenergic receptor
Ligand
BDBM50025124
Substrate
Meas. Tech.
ChEMBL_34593 (CHEMBL645552)
Ki
5.5±n/a nM
Citation
 Wouters, WJanssen, CGVan Dun, JThijssen, JBLaduron, PM In vitro labeling of serotonin-S2 receptors: synthesis and binding characteristics of [3H]-7-aminoketanserin. J Med Chem 29:1663-8 (1986)  
Target
Name:
Alpha-1A/Alpha-1B/Alpha-1D adrenergic receptor
Synonyms:
Adrenergic receptor alpha-1 alpha-1 Adrenergic Receptor
Type:
Mol. Mass.:
Description:
ASSAY_ID of EBI is 303470
Components:
This complex has 3 components.
Component 1
Name:
Alpha-1B adrenergic receptor
Synonyms:
ADA1B_RAT Alpha 1B-adrenoceptor Alpha adrenergic receptor 1A and 1B Alpha-1Adrenoceptor Alpha-1B adrenoreceptor | adrenergic Alpha1B
Type:
G Protein-Coupled Receptor (GPCR)
Mol. Mass.:
56606.71
Organism:
Rattus norvegicus (rat)
Description:
Receptor binding assays were performed using rat cortical membranes.
Residue:
515
  
Component 2
Name:
Alpha-1A adrenergic receptor
Synonyms:
ADA1A_RAT Adra1c Alpha-1A adrenoceptor Alpha-1C adrenergic receptor | adrenergic Alpha1A
Type:
Protein
Mol. Mass.:
51620.15
Organism:
Rattus norvegicus (Rat)
Description:
P43140
Residue:
466
  
Component 3
Name:
Alpha-1D adrenergic receptor
Synonyms:
ADA1D_RAT Adra1d Alpha-1D adrenergic receptor | Serotonin 1a (5-HT1a) receptor/Adrenergic receptor alpha-1
Type:
Protein
Mol. Mass.:
59375.97
Organism:
Rattus norvegicus (Rat)
Description:
P23944
Residue:
561
  
Inhibitor
Name:
BDBM50025124
Synonyms:
3-{2-[4-(4-Fluoro-benzoyl)-piperidin-1-yl]-ethyl}-7-hydroxy-1H-quinazoline-2,4-dione | CHEMBL46683
Type:
Small organic molecule
Emp. Form.:
C22H22FN3O4
Mol. Mass.:
411.4262
SMILES:
Oc1ccc2c(c1)[nH]c(=O)n(CCN1CCC(CC1)C(=O)c1ccc(F)cc1)c2=O
: