Target
Thymidylate synthase
Ligand
BDBM18771
Substrate
Meas. Tech.
ChEBML_209136
Ki
10±n/a nM
Citation
 Pogolotti, ALDanenberg, PVSanti, DV Kinetics and mechanism of interaction of 10-propargyl-5,8-dideazafolate with thymidylate synthase. J Med Chem 29:478-82 (1986)  
Target
Name:
Thymidylate synthase
Synonyms:
TSase Thymidylate Synthase (TS) thyA
Type:
Enzyme
Mol. Mass.:
36576.54
Organism:
Lactobacillus casei
Description:
Residue:
316
  
Inhibitor
Name:
BDBM18771
Synonyms:
(2S)-2-[(4-{[(2-amino-4-oxo-1,4-dihydroquinazolin-6-yl)methyl](prop-2-yn-1-yl)amino}phenyl)formamido]pentanedioic acid CHEMBL389051 | PDDF
Type:
Small organic molecule
Emp. Form.:
C24H23N5O6
Mol. Mass.:
477.4693
SMILES:
Nc1nc2ccc(CN(CC#C)c3ccc(cc3)C(=O)N[C@@H](CCC(O)=O)C(O)=O)cc2c(=O)[nH]1
: