Target
Sialidase
Ligand
BDBM50466473
Substrate
Meas. Tech.
ChEMBL_1793223 (CHEMBL4265142)
IC50
28900±n/a nM
Citation
 Slack, TJLi, WShi, DMcArthur, JBZhao, GLi, YXiao, AKhedri, ZYu, HLiu, YChen, X Triazole-linked transition state analogs as selective inhibitors against V. cholerae sialidase. Bioorg Med Chem 26:5751-5757 (2018)  
Target
Name:
Sialidase
Synonyms:
NANH_VIBCH | nanH
Type:
PROTEIN
Mol. Mass.:
85590.05
Organism:
Vibrio cholerae
Description:
ChEMBL_631810
Residue:
781
  
Inhibitor
Name:
BDBM50466473
Synonyms:
CHEMBL4278803
Type:
Small organic molecule
Emp. Form.:
C32H50N10O15
Mol. Mass.:
814.7974
SMILES:
[H][C@]1(OC(=C[C@H](O)[C@H]1NC(C)=O)C(O)=O)[C@H](O)[C@H](O)Cn1cc(C[C@H](NC(=O)[C@@H](N)CCC(O)=O)C(=O)N[C@@H](CCCCN)C(=O)N[C@@H](CCC(O)=O)C(N)=O)nn1
: