Target
Neuronal acetylcholine receptor subunit alpha-7
Ligand
BDBM50466606
Substrate
Meas. Tech.
ChEMBL_1793437 (CHEMBL4265356)
IC50
24±n/a nM
Citation
 Bavo, FPucci, SFasoli, FLammi, CMoretti, MMucchietto, VLattuada, DViani, PDe Palma, CBudriesi, RCorradini, IDowell, CMcIntosh, JMClementi, FBolchi, CGotti, CPallavicini, M Potent Antiglioblastoma Agents by Hybridizing the Onium-Alkyloxy-Stilbene Based Structures of an ?7-nAChR, ?9-nAChR Antagonist and of a Pro-Oxidant Mitocan. J Med Chem 61:10531-10544 (2018)  
Target
Name:
Neuronal acetylcholine receptor subunit alpha-7
Synonyms:
ACHA7_HUMAN Cholinergic, Nicotinic Alpha7 Neuronal acetylcholine receptor protein alpha-7 subunit Nicotinic acetylcholine receptor alpha-7 (alpha7 nAChR)
Type:
Mol. Mass.:
56448.33
Organism:
Homo sapiens (Human)
Description:
CHRNA7 (NACHRA7)
Residue:
502
  
Inhibitor
Name:
BDBM50466606
Synonyms:
CHEMBL4280452
Type:
Small organic molecule
Emp. Form.:
C26H38INO3
Mol. Mass.:
539.4893
SMILES:
[I-].CC[N+](CC)(CC)CCCCOc1ccc(\C=C\c2cc(OC)cc(OC)c2)cc1
: