Target
Adenosine receptor A2a
Ligand
BDBM50025578
Substrate
Meas. Tech.
ChEBML_27755
Ki
400±n/a nM
Citation
 Daly, JWPadgett, WLShamim, MT Analogues of caffeine and theophylline: effect of structural alterations on affinity at adenosine receptors. J Med Chem 29:1305-8 (1987)  
Target
Name:
Adenosine receptor A2a
Synonyms:
AA2AR_CAVPO ADORA2A | Adenosine A2a receptor
Type:
Enzyme Catalytic Domain
Mol. Mass.:
44955.08
Organism:
GUINEA PIG
Description:
ADENOSINE A2 0 GUINEA PIG::P46616
Residue:
409
  
Inhibitor
Name:
BDBM50025578
Synonyms:
1,3-Dipropyl-7-prop-2-ynyl-3,7-dihydro-purine-2,6-dione | CHEMBL25223
Type:
Small organic molecule
Emp. Form.:
C14H18N4O2
Mol. Mass.:
274.3183
SMILES:
CCCn1c2ncn(CC#C)c2c(=O)n(CCC)c1=O
: