Target
ALK tyrosine kinase receptor/Echinoderm microtubule-associated protein-like 4
Ligand
BDBM50018830
Substrate
Meas. Tech.
ChEMBL_1794135 (CHEMBL4266252)
IC50
21±n/a nM
Citation
 Basit, SAshraf, ZLee, KLatif, M First macrocyclic 3 Eur J Med Chem 134:348-356 (2017)  
Target
Name:
ALK tyrosine kinase receptor/Echinoderm microtubule-associated protein-like 4
Synonyms:
EML4-ALK
Type:
Protein
Mol. Mass.:
Description:
Components:
This complex has 2 components.
Component 1
Name:
ALK tyrosine kinase receptor
Synonyms:
ALK ALK_HUMAN CD_antigen: CD246
Type:
Protein
Mol. Mass.:
176453.10
Organism:
Homo sapiens (Human)
Description:
Q9UM73
Residue:
1620
  
Component 2
Name:
Echinoderm microtubule-associated protein-like 4
Synonyms:
C2orf2 EMAP-4 EML4 Restrictedly overexpressed proliferation-associated protein | Ropp 120
Type:
PROTEIN
Mol. Mass.:
108911.92
Organism:
Homo sapiens
Description:
ChEMBL_118387
Residue:
981
  
Inhibitor
Name:
BDBM50018830
Synonyms:
CHEMBL3286830 US10780082, Compound PF-06463922 | US11517561, Compound PF-06463922
Type:
Small organic molecule
Emp. Form.:
C21H19FN6O2
Mol. Mass.:
406.413
SMILES:
C[C@H]1Oc2cc(cnc2N)-c2c(CN(C)C(=O)c3ccc(F)cc13)nn(C)c2C#N
: