Target
Farnesyl pyrophosphate synthase
Ligand
BDBM12578
Substrate
Meas. Tech.
ChEMBL_1795608 (CHEMBL4267725)
IC50
60±n/a nM
Citation
 Savino, SToscano, APurgatorio, RProfilo, ELaghezza, ATortorella, PAngelelli, MCellamare, SScala, RTricarico, DMarobbio, CMTPerna, FVitale, PAgamennone, MDimiccoli, VTolomeo, AScilimati, A Novel bisphosphonates with antiresorptive effect in bone mineralization and osteoclastogenesis. Eur J Med Chem 158:184-200 (2018)  
Target
Name:
Farnesyl pyrophosphate synthase
Synonyms:
Dimethylallyltranstransferase FPP synthase FPPS_HUMAN Farnesyl diphosphate synthase Farnesyl diphosphate synthetase Farnesyl pyrophosphate synthetase KIAA1293 | P14324
Type:
Enzyme
Mol. Mass.:
48272.89
Organism:
Homo sapiens (Human)
Description:
P14324
Residue:
419
  
Inhibitor
Name:
BDBM12578
Synonyms:
2-(imidazol-1-yl)-1-hydroxyethylidene-1,1-bisphosphonic acid CGP-42446 JMC515594 Compound 55 US11279719, Example Zolendronic acid (ZOL) Zoledronate [1-hydroxy-2-(1H-imidazol-1-yl)-1-phosphonoethyl]phosphonic acid | zoledronic acid
Type:
Small organic molecule
Emp. Form.:
C5H10N2O7P2
Mol. Mass.:
272.0896
SMILES:
OC(Cn1ccnc1)(P(O)(O)=O)P(O)(O)=O
: