Target
Chymotrypsinogen B
Ligand
BDBM50025859
Substrate
Meas. Tech.
ChEMBL_216621 (CHEMBL819193)
Ki
6500±n/a nM
Citation
 Kinder, DHKatzenellenbogen, JA Acylamino boronic acids and difluoroborane analogues of amino acids: potent inhibitors of chymotrypsin and elastase. J Med Chem 28:1917-25 (1986)  
Target
Name:
Chymotrypsinogen B
Synonyms:
Beta-chymotrypsin CTRB1 Chymotrypsin B chain A Chymotrypsin B chain C Synonyms=CTRB
Type:
PROTEIN
Mol. Mass.:
27713.98
Organism:
Homo sapiens (Human)
Description:
ChEMBL_10909
Residue:
263
  
Inhibitor
Name:
BDBM50025859
Synonyms:
CHEMBL61146 | N-(2-phenyl ethyl)acetamide boronic acid
Type:
Small organic molecule
Emp. Form.:
C10H14BNO3
Mol. Mass.:
207.034
SMILES:
CC(=O)NC(Cc1ccccc1)B(O)O
: