Target
Chymotrypsinogen B
Ligand
BDBM50025874
Substrate
Meas. Tech.
ChEMBL_216621 (CHEMBL819193)
Ki
2000±n/a nM
Citation
 Kinder, DHKatzenellenbogen, JA Acylamino boronic acids and difluoroborane analogues of amino acids: potent inhibitors of chymotrypsin and elastase. J Med Chem 28:1917-25 (1986)  
Target
Name:
Chymotrypsinogen B
Synonyms:
Beta-chymotrypsin CTRB1 Chymotrypsin B chain A Chymotrypsin B chain C Synonyms=CTRB
Type:
PROTEIN
Mol. Mass.:
27713.98
Organism:
Homo sapiens (Human)
Description:
ChEMBL_10909
Residue:
263
  
Inhibitor
Name:
BDBM50025874
Synonyms:
2-Amino-N-benzylpropanamide difluoroborane | CHEMBL300834
Type:
Small organic molecule
Emp. Form.:
C10H13BF2N2O
Mol. Mass.:
226.031
SMILES:
CC(N)C(=O)NC(B(F)F)c1ccccc1
: