Target
Proto-oncogene tyrosine-protein kinase Src
Ligand
BDBM50467693
Substrate
Meas. Tech.
ChEMBL_1796639 (CHEMBL4268756)
Ki
60±n/a nM
Citation
 Molinari, AFallacara, ALDi Maria, SZamperini, CPoggialini, FMusumeci, FSchenone, SAngelucci, AColapietro, ACrespan, EKissova, MMaga, GBotta, M Efficient optimization of pyrazolo[3,4-d]pyrimidines derivatives as c-Src kinase inhibitors in neuroblastoma treatment. Bioorg Med Chem Lett 28:3454-3457 (2018)  
Target
Name:
Proto-oncogene tyrosine-protein kinase Src
Synonyms:
Calmodulin/Proto-oncogene tyrosine-protein kinase Src Proto-oncogene c-Src SRC SRC_HUMAN V-src sarcoma (Schmidt-Ruppin A-2) viral oncogene homolog (avian) p60-Src | pp60c-src
Type:
Protein
Mol. Mass.:
59838.60
Organism:
Homo sapiens (Human)
Description:
P12931
Residue:
536
  
Inhibitor
Name:
BDBM50467693
Synonyms:
CHEMBL4288646
Type:
Small organic molecule
Emp. Form.:
C26H29ClN6O2S
Mol. Mass.:
525.065
SMILES:
CC(Cn1ncc2c(Nc3cc(O)ccc3Cl)nc(SCCN3CCOCC3)nc12)c1ccccc1
: