Target
Proto-oncogene tyrosine-protein kinase Src
Ligand
BDBM50467698
Substrate
Meas. Tech.
ChEMBL_1796639 (CHEMBL4268756)
Ki
17±n/a nM
Citation
 Molinari, AFallacara, ALDi Maria, SZamperini, CPoggialini, FMusumeci, FSchenone, SAngelucci, AColapietro, ACrespan, EKissova, MMaga, GBotta, M Efficient optimization of pyrazolo[3,4-d]pyrimidines derivatives as c-Src kinase inhibitors in neuroblastoma treatment. Bioorg Med Chem Lett 28:3454-3457 (2018)  
Target
Name:
Proto-oncogene tyrosine-protein kinase Src
Synonyms:
Calmodulin/Proto-oncogene tyrosine-protein kinase Src Proto-oncogene c-Src SRC SRC_HUMAN V-src sarcoma (Schmidt-Ruppin A-2) viral oncogene homolog (avian) p60-Src | pp60c-src
Type:
Protein
Mol. Mass.:
59838.60
Organism:
Homo sapiens (Human)
Description:
P12931
Residue:
536
  
Inhibitor
Name:
BDBM50467698
Synonyms:
CHEMBL4286320
Type:
Small organic molecule
Emp. Form.:
C19H15Cl2N5O
Mol. Mass.:
400.261
SMILES:
Oc1ccc(Cl)c(Nc2ncnc3n(CC(Cl)c4ccccc4)ncc23)c1
: