Target
Intestinal-type alkaline phosphatase
Ligand
BDBM18073
Substrate
Meas. Tech.
ChEMBL_1797058 (CHEMBL4269175)
IC50
100000±n/a nM
Citation
 Ashraf, AEjaz, SARahman, SUSiddiqui, WAArshad, MNLecka, JSévigny, JZayed, MEMAsiri, AMIqbal, JHartinger, CGHanif, M Hybrid compounds from chalcone and 1,2-benzothiazine pharmacophores as selective inhibitors of alkaline phosphatase isozymes. Eur J Med Chem 159:282-291 (2018)  
Target
Name:
Intestinal-type alkaline phosphatase
Synonyms:
ALPI Intestinal alkaline phosphatase | PPBI_HUMAN
Type:
PROTEIN
Mol. Mass.:
56804.94
Organism:
Homo sapiens (Human)
Description:
ChEMBL_1278525
Residue:
528
  
Inhibitor
Name:
BDBM18073
Synonyms:
(2S)-2-amino-3-phenylpropanoic acid L-[2,3,4,5,6-3H]phenylalanine Phenylalanine | US11021454, Compound L-phe
Type:
Amino Acid
Emp. Form.:
C9H11NO2
Mol. Mass.:
165.1891
SMILES:
N[C@@H](Cc1ccccc1)C(O)=O
: