Target
Receptor-interacting serine/threonine-protein kinase 2
Ligand
BDBM50467986
Substrate
Meas. Tech.
ChEMBL_1797481 (CHEMBL4269598)
IC50
2.5±n/a nM
Citation
 Haile, PACasillas, LNBury, MJMehlmann, JFSinghaus, RCharnley, AKHughes, TVDeMartino, MPWang, GZRomano, JJDong, XPlotnikov, NVLakdawala, ASConvery, MAVotta, BJLipshutz, DBDesai, BMSwift, BCapriotti, CABerger, SBMahajan, MKReilly, MARivera, EJSun, HHNagilla, RLePage, COuellette, MTTotoritis, RDDonovan, BTBrown, BSChaudhary, KWGough, PJBertin, JMarquis, RW Identification of Quinoline-Based RIP2 Kinase Inhibitors with an Improved Therapeutic Index to the hERG Ion Channel. ACS Med Chem Lett 9:1039-1044 (2018)  
Target
Name:
Receptor-interacting serine/threonine-protein kinase 2
Synonyms:
CARDIAK RIP2 RIPK2_HUMAN Tyrosine-protein kinase RIPK2 | receptor-interacting serine/threonine-protein kinase 2
Type:
Protein
Mol. Mass.:
61201.30
Organism:
Homo sapiens (Human)
Description:
Residue:
540
  
Inhibitor
Name:
BDBM50467986
Synonyms:
CHEMBL4289904
Type:
Small organic molecule
Emp. Form.:
C20H26N4O4S
Mol. Mass.:
418.51
SMILES:
Cc1[nH]nc(Nc2ccnc3cc(OCCO)c(cc23)S(=O)(=O)C(C)(C)C)c1C
: