Target
Potassium voltage-gated channel subfamily H member 2
Ligand
BDBM50467989
Substrate
Meas. Tech.
ChEMBL_1797483 (CHEMBL4269600)
IC50
>30000±n/a nM
Citation
 Haile, PACasillas, LNBury, MJMehlmann, JFSinghaus, RCharnley, AKHughes, TVDeMartino, MPWang, GZRomano, JJDong, XPlotnikov, NVLakdawala, ASConvery, MAVotta, BJLipshutz, DBDesai, BMSwift, BCapriotti, CABerger, SBMahajan, MKReilly, MARivera, EJSun, HHNagilla, RLePage, COuellette, MTTotoritis, RDDonovan, BTBrown, BSChaudhary, KWGough, PJBertin, JMarquis, RW Identification of Quinoline-Based RIP2 Kinase Inhibitors with an Improved Therapeutic Index to the hERG Ion Channel. ACS Med Chem Lett 9:1039-1044 (2018)  
Target
Name:
Potassium voltage-gated channel subfamily H member 2
Synonyms:
1,3-beta-glucan synthase component GLS2 ERG Eag-related protein 1 Ether-a-go-go-related gene (HERG) Ether-a-go-go-related gene potassium channel 1 Ether-a-go-go-related gene potassium channel 1 (hERG1) Ether-a-go-go-related protein 1 H-ERG KCNH2 Potassium voltage-gated channel subfamily H member 2 (hERG) Voltage-gated potassium channel subunit Kv11.1 hERG Potassium Channel 1 | putative potassium channel subunit
Type:
Multi-pass membrane protein
Mol. Mass.:
126672.65
Organism:
Homo sapiens (Human)
Description:
Q12809
Residue:
1159
  
Inhibitor
Name:
BDBM50467989
Synonyms:
CHEMBL4282034
Type:
Small organic molecule
Emp. Form.:
C20H26N4O3S
Mol. Mass.:
402.51
SMILES:
CCOc1cc2nccc(Nc3n[nH]c(C)c3C)c2cc1S(=O)(=O)C(C)(C)C
: