Target
Receptor-interacting serine/threonine-protein kinase 2
Ligand
BDBM50467984
Substrate
Meas. Tech.
ChEMBL_1797531 (CHEMBL4269648)
IC50
13±n/a nM
Citation
 Haile, PACasillas, LNBury, MJMehlmann, JFSinghaus, RCharnley, AKHughes, TVDeMartino, MPWang, GZRomano, JJDong, XPlotnikov, NVLakdawala, ASConvery, MAVotta, BJLipshutz, DBDesai, BMSwift, BCapriotti, CABerger, SBMahajan, MKReilly, MARivera, EJSun, HHNagilla, RLePage, COuellette, MTTotoritis, RDDonovan, BTBrown, BSChaudhary, KWGough, PJBertin, JMarquis, RW Identification of Quinoline-Based RIP2 Kinase Inhibitors with an Improved Therapeutic Index to the hERG Ion Channel. ACS Med Chem Lett 9:1039-1044 (2018)  
Target
Name:
Receptor-interacting serine/threonine-protein kinase 2
Synonyms:
Receptor-interacting serine/threonine-protein kinase 2 Tyrosine-protein kinase RIPK2
Type:
PROTEIN
Mol. Mass.:
60785.84
Organism:
Rattus norvegicus
Description:
ChEMBL_116814
Residue:
539
  
Inhibitor
Name:
BDBM50467984
Synonyms:
CHEMBL4293287
Type:
Small organic molecule
Emp. Form.:
C19H24N4O3S
Mol. Mass.:
388.484
SMILES:
COc1cc2nccc(Nc3n[nH]c(C)c3C)c2cc1S(=O)(=O)C(C)(C)C
: