Target
Receptor-interacting serine/threonine-protein kinase 2
Ligand
BDBM50467989
Substrate
Meas. Tech.
ChEMBL_1797481 (CHEMBL4269598)
IC50
1.6±n/a nM
Citation
 Haile, PACasillas, LNBury, MJMehlmann, JFSinghaus, RCharnley, AKHughes, TVDeMartino, MPWang, GZRomano, JJDong, XPlotnikov, NVLakdawala, ASConvery, MAVotta, BJLipshutz, DBDesai, BMSwift, BCapriotti, CABerger, SBMahajan, MKReilly, MARivera, EJSun, HHNagilla, RLePage, COuellette, MTTotoritis, RDDonovan, BTBrown, BSChaudhary, KWGough, PJBertin, JMarquis, RW Identification of Quinoline-Based RIP2 Kinase Inhibitors with an Improved Therapeutic Index to the hERG Ion Channel. ACS Med Chem Lett 9:1039-1044 (2018)  
Target
Name:
Receptor-interacting serine/threonine-protein kinase 2
Synonyms:
CARDIAK RIP2 RIPK2_HUMAN Tyrosine-protein kinase RIPK2 | receptor-interacting serine/threonine-protein kinase 2
Type:
Protein
Mol. Mass.:
61201.30
Organism:
Homo sapiens (Human)
Description:
Residue:
540
  
Inhibitor
Name:
BDBM50467989
Synonyms:
CHEMBL4282034
Type:
Small organic molecule
Emp. Form.:
C20H26N4O3S
Mol. Mass.:
402.51
SMILES:
CCOc1cc2nccc(Nc3n[nH]c(C)c3C)c2cc1S(=O)(=O)C(C)(C)C
: