Target
Lysine-specific demethylase 5A
Ligand
BDBM50468050
Substrate
Meas. Tech.
ChEMBL_1797932 (CHEMBL4270049)
IC50
220±n/a nM
Citation
 Horton, JRWoodcock, CBChen, QLiu, XZhang, XShanks, JRai, GMott, BTJansen, DJKales, SCHenderson, MJCyr, MPohida, KHu, XShah, PXu, XJadhav, AMaloney, DJHall, MDSimeonov, AFu, HVertino, PMCheng, X Structure-Based Engineering of Irreversible Inhibitors against Histone Lysine Demethylase KDM5A. J Med Chem 61:10588-10601 (2018)  
Target
Name:
Lysine-specific demethylase 5A
Synonyms:
Histone demethylase JARID1A Jumonji/ARID domain-containing protein 1A KDM5A_HUMAN RBBP-2 RBP2 | Retinoblastoma-binding protein 2
Type:
Protein
Mol. Mass.:
192091.79
Organism:
Homo sapiens (Human)
Description:
P29375
Residue:
1690
  
Inhibitor
Name:
BDBM50468050
Synonyms:
CHEMBL4287599
Type:
Small organic molecule
Emp. Form.:
C28H34N4O4S
Mol. Mass.:
522.659
SMILES:
CN(C)C\C=C\C(=O)Nc1cccc(c1)C(OCCN1CCCCC1)c1cc2nccc(C(O)=O)c2s1
: