Target
Lysine-specific demethylase 4A
Ligand
BDBM50468050
Substrate
Meas. Tech.
ChEMBL_1797933 (CHEMBL4270050)
IC50
5300±n/a nM
Citation
 Horton, JRWoodcock, CBChen, QLiu, XZhang, XShanks, JRai, GMott, BTJansen, DJKales, SCHenderson, MJCyr, MPohida, KHu, XShah, PXu, XJadhav, AMaloney, DJHall, MDSimeonov, AFu, HVertino, PMCheng, X Structure-Based Engineering of Irreversible Inhibitors against Histone Lysine Demethylase KDM5A. J Med Chem 61:10588-10601 (2018)  
Target
Name:
Lysine-specific demethylase 4A
Synonyms:
JHDM3A JMJD2A Jumonji domain-containing protein 2A KDM4A_HUMAN Lysine-specific demethylase 4A | Lysine-specific demethylase 4A (KDM4A)
Type:
Enzyme
Mol. Mass.:
120647.83
Organism:
Homo sapiens (Human)
Description:
O75164
Residue:
1064
  
Inhibitor
Name:
BDBM50468050
Synonyms:
CHEMBL4287599
Type:
Small organic molecule
Emp. Form.:
C28H34N4O4S
Mol. Mass.:
522.659
SMILES:
CN(C)C\C=C\C(=O)Nc1cccc(c1)C(OCCN1CCCCC1)c1cc2nccc(C(O)=O)c2s1
: