Target
Somatostatin receptor type 5
Ligand
BDBM50468159
Substrate
Meas. Tech.
ChEMBL_1798205 (CHEMBL4270322)
IC50
0.700000±n/a nM
Citation
 Liu, WHussain, ZZang, YSweis, RFRomero, FAFinke, PEMoningka, RBao, JPlotkin, MAShang, JDingley, KHSalituro, GMurphy, BAHoward, ADUjjainwalla, FWood, HBDuffy, JL Optimization of Preclinical Metabolism for Somatostatin Receptor Subtype 5-Selective Antagonists. ACS Med Chem Lett 9:1088-1093 (2018)  
Target
Name:
Somatostatin receptor type 5
Synonyms:
SOMATOSTATIN SST5 SS5-R SSR5_HUMAN Somatostatin receptor type 5 (SSTR5)
Type:
Enzyme
Mol. Mass.:
39218.02
Organism:
Homo sapiens (Human)
Description:
P35346
Residue:
364
  
Inhibitor
Name:
BDBM50468159
Synonyms:
CHEMBL4278328
Type:
Small organic molecule
Emp. Form.:
C30H35N3O3
Mol. Mass.:
485.6172
SMILES:
CC(C)n1cc(CN2CCC3(CN(C(=O)C3)c3ccc(cc3)C(O)=O)CC2)c2c(cccc12)C1CC1
: