Target
Fibroblast growth factor receptor 2
Ligand
BDBM50399539
Substrate
Meas. Tech.
ChEMBL_1799438 (CHEMBL4271730)
IC50
83±n/a nM
Citation
 Wei, MPeng, XXing, LDai, YHuang, RGeng, MZhang, AAi, JSong, Z Design, synthesis and biological evaluation of a series of novel 2-benzamide-4-(6-oxy-N-methyl-1-naphthamide)-pyridine derivatives as potent fibroblast growth factor receptor (FGFR) inhibitors. Eur J Med Chem 154:9-28 (2018)  
Target
Name:
Fibroblast growth factor receptor 2
Synonyms:
BEK FGFR-2 FGFR2 Fibroblast growth factor receptor 2 (FGFR2) KGFR Keratinocyte growth factor receptor VEGF-receptor 2 and Fibroblast growth factor receptor 2
Type:
Enzyme
Mol. Mass.:
92015.45
Organism:
Homo sapiens (Human)
Description:
P21802
Residue:
821
  
Inhibitor
Name:
BDBM50399539
Synonyms:
CHEMBL2180605
Type:
Small organic molecule
Emp. Form.:
C26H25N3O4
Mol. Mass.:
443.4944
SMILES:
CNC(=O)c1cccc2cc(Oc3ccnc4cc(OCC5(N)CC5)c(OC)cc34)ccc12
: