Target
Dihydrofolate reductase
Ligand
BDBM50026276
Substrate
Meas. Tech.
ChEMBL_54963 (CHEMBL666694)
IC50
4.9±n/a nM
Citation
 Hynes, JBHarmon, SJFloyd, GGFarrington, MHart, LDGale, GRWashtien, WLSusten, SSFreisheim, JH Chemistry and antitumor evaluation of selected classical 2,4-diaminoquinazoline analogues of folic acid. J Med Chem 28:209-15 (1985)  
Target
Name:
Dihydrofolate reductase
Synonyms:
DYR_RAT Dihydrofolate reductase (DHFR) Tetrahydrofolate dehydrogenase
Type:
Enzyme
Mol. Mass.:
21638.84
Organism:
Rattus norvegicus (rat)
Description:
Residue:
187
  
Inhibitor
Name:
BDBM50026276
Synonyms:
2-{4-[(2,4-Diamino-quinazolin-6-ylmethyl)-formyl-amino]-benzoylamino}-pentanedioic acid | CHEMBL303654
Type:
Small organic molecule
Emp. Form.:
C22H22N6O6
Mol. Mass.:
466.4467
SMILES:
Nc1nc(N)c2cc(CN(C=O)c3ccc(cc3)C(=O)NC(CCC(O)=O)C(O)=O)ccc2n1
: