Target
Dihydrofolate reductase
Ligand
BDBM50026274
Substrate
Meas. Tech.
ChEMBL_54963 (CHEMBL666694)
IC50
5.3±n/a nM
Citation
 Hynes, JBHarmon, SJFloyd, GGFarrington, MHart, LDGale, GRWashtien, WLSusten, SSFreisheim, JH Chemistry and antitumor evaluation of selected classical 2,4-diaminoquinazoline analogues of folic acid. J Med Chem 28:209-15 (1985)  
Target
Name:
Dihydrofolate reductase
Synonyms:
DYR_RAT Dihydrofolate reductase (DHFR) Tetrahydrofolate dehydrogenase
Type:
Enzyme
Mol. Mass.:
21638.84
Organism:
Rattus norvegicus (rat)
Description:
Residue:
187
  
Inhibitor
Name:
BDBM50026274
Synonyms:
2-{4-[(2,4-Diamino-quinazolin-6-ylmethyl)-methyl-amino]-benzoylamino}-pentanedioic acid | CHEMBL304397
Type:
Small organic molecule
Emp. Form.:
C22H24N6O5
Mol. Mass.:
452.4632
SMILES:
CN(Cc1ccc2nc(N)nc(N)c2c1)c1ccc(cc1)C(=O)NC(CCC(O)=O)C(O)=O
: