Target
ATP-citrate synthase
Ligand
BDBM50036210
Substrate
Meas. Tech.
ChEMBL_1803477 (CHEMBL4275769)
Ki
300000±n/a nM
Citation
 Granchi, C ATP citrate lyase (ACLY) inhibitors: An anti-cancer strategy at the crossroads of glucose and lipid metabolism. Eur J Med Chem 157:1276-1291 (2018)  
Target
Name:
ATP-citrate synthase
Synonyms:
ACLY | ACLY_HUMAN
Type:
PROTEIN
Mol. Mass.:
120848.43
Organism:
Homo sapiens (Human)
Description:
ChEMBL_455196
Residue:
1101
  
Inhibitor
Name:
BDBM50036210
Synonyms:
(2S,3S)-3-Carboxy-2,3-dihydroxy-pentanedioic acid | CHEMBL118715
Type:
Small organic molecule
Emp. Form.:
C6H8O8
Mol. Mass.:
208.1229
SMILES:
O[C@H](C(O)=O)[C@@](O)(CC(O)=O)C(O)=O
: