Target
Melatonin receptor type 1C
Ligand
BDBM50034101
Substrate
Meas. Tech.
ChEMBL_104754 (CHEMBL712437)
Ki
565±n/a nM
Citation
 Garratt, PJJones, RTocher, DASugden, D Mapping the melatonin receptor. 3. Design and synthesis of melatonin agonists and antagonists derived from 2-phenyltryptamines. J Med Chem 38:1132-9 (1995)  
Target
Name:
Melatonin receptor type 1C
Synonyms:
CKB Mel-1C-R Melatonin receptor type 1C
Type:
PROTEIN
Mol. Mass.:
38595.98
Organism:
Gallus gallus
Description:
ChEMBL_104739
Residue:
346
  
Inhibitor
Name:
BDBM50034101
Synonyms:
CHEMBL14701 Cyclobutanecarboxylic acid [2-(2-phenyl-1H-indol-3-yl)-ethyl]-amide | N-CBCPT
Type:
Small organic molecule
Emp. Form.:
C21H22N2O
Mol. Mass.:
318.4122
SMILES:
O=C(NCCc1c([nH]c2ccccc12)-c1ccccc1)C1CCC1
: